{"text_format":"1","workbook":"xlsx","n_sheets":5,"sheets":["UserData","ItemsData","LanguageData","CurrencyData ","ProgramData"],"not_rendered":{"charts":4,"images":5,"macros":1,"external_links":0,"defined_names":67,"comments":0,"pivot_tables":0},"unopened":[],"bounds":{"document_bytes":16777216,"sheet_cells":100000,"rows_first":2000,"rows_last":500,"rows_between":2000,"halvings":0,"cell_chars":16384,"cell_head_chars":4096},"cells_cut":0,"cells_raw":0,"read":"whole","date_system":"1900"}

{"sheet":"UserData","index":0,"n_rows":95,"n_cols":15,"rows_kept":95,"cut":false,"hidden":false,"merged":[[21,6,21,7],[21,8,21,9],[23,6,23,7],[12,4,12,5],[13,1,13,3],[22,3,22,5],[21,3,21,5],[0,1,1,9],[2,1,2,9],[35,3,35,9],[36,7,36,8],[19,1,19,3],[14,1,14,3],[27,6,27,7],[27,8,27,9],[22,6,22,7],[22,8,22,9],[26,3,26,5],[26,6,26,7],[26,8,26,9],[27,3,27,5],[25,3,25,5],[25,6,25,7],[25,8,25,9],[19,4,19,5],[23,3,23,5],[0,12,1,14],[20,1,20,9],[5,1,5,9],[6,1,6,3],[7,1,7,3],[6,4,6,5],[7,4,7,5],[8,1,8,3],[8,4,8,5],[15,1,15,3],[15,4,15,5],[16,1,16,3],[16,4,16,5],[28,6,28,7],[28,8,28,9],[29,3,29,5],[29,6,29,7],[29,8,29,9],[94,12,94,14],[94,1,94,9],[61,12,61,14],[61,1,61,9],[4,12,4,13],[32,6,32,7],[32,2,32,5],[32,8,32,9],[23,8,23,9],[24,3,24,5],[24,6,24,7],[14,4,14,5],[9,1,9,3],[9,4,9,5],[30,8,30,9],[28,3,28,5],[36,3,36,5],[12,1,12,3],[33,2,33,5],[30,3,30,5],[2,12,2,14],[10,1,10,3],[10,4,10,5],[3,1,3,2],[4,8,4,9],[3,3,3,6],[6,7,6,9],[11,1,11,3],[11,4,11,5],[13,4,13,5],[24,8,24,9],[30,6,30,7],[3,12,3,13],[17,4,17,5],[18,4,18,5],[17,1,17,3],[18,1,18,3],[3,7,3,9]]}
[null,{"$f":"INDEX(LanguageData!$C$3:$L$200,MATCH(\"CostAnalysis\",LanguageData!$B$3:$B$200,0),MATCH(LanguageSelect,LanguageData!$C$2:$L$2,0))& \" EasyMink - EM   Ver. \" & ProgramVersion","v":"Omkostnings - og gevinst analyse EasyMink - EM   Ver. 1.0.3.5"},null,null,null,null,null,null,null,null,null,null,{"$f":"B1","v":"Omkostnings - og gevinst analyse EasyMink - EM   Ver. 1.0.3.5"}]
[]
[null,{"$f":"IF(Customer=\"\",,$B$33) &\" \" &Customer& \" - \" &IF(PhoneNumber=\"\",,$G$33)& \" \" &PhoneNumber& \" - \" & IF(E_mail=\"\",,$B$34)& \" \" &E_mail","v":"  -   -  "},null,null,null,null,null,null,null,null,null,null,{"$f":"$B$3","v":"  -   -  "}]
[null,{"$f":"INDEX(LanguageData!$C$3:$L$200,MATCH(\"SelectLanguageBelow\",LanguageData!$B$3:$B$200,0),MATCH(LanguageSelect,LanguageData!$C$2:$L$2,0))","v":"Vælg sprog herunder, klik for at vælge."},null,{"$f":"INDEX(LanguageData!$C$3:$L$200,MATCH(\"SelectCustomerType\",LanguageData!$B$3:$B$200,0),MATCH(LanguageSelect,LanguageData!$C$2:$L$2,0))","v":"Hvis det er en opgradering brug tjekboksen"},null,null,null,{"$f":"INDEX(LanguageData!$C$3:$L$200,MATCH(\"Currency\",LanguageData!$B$3:$B$200,0),MATCH(LanguageSelect,LanguageData!$C$2:$L$2,0))","v":"Valuta"},null,null,null,null,{"$f":"INDEX(LanguageData!$C$3:$L$200,MATCH(\"CostAnalysis\",LanguageData!$B$3:$B$200,0),MATCH(LanguageSelect,LanguageData!$C$2:$L$2,0))&\" - \"&INDEX(LanguageData!$C$3:$L$200,MATCH(\"ProducedSkins\",LanguageData!$B$3:$B$200,0),MATCH(LanguageSelect,LanguageData!$C$2:$L$2,0))& \"  -  \" &INDEX(LanguageData!$C$3:$L$200,MATCH(\"NewKitsAverage\",LanguageData!$B$3:$B$200,0),MATCH(LanguageSelect,LanguageData!$C$2:$L$2,0))","v":"Omkostnings - og gevinst analyse - produceret skind pr. år  -  nyt beregnet hvalpegennemsnit er"},null,{"$f":"INDEX(LanguageData!$C$3:$L$200,MATCH(\"Unit\",LanguageData!$B$3:$B$200,0),MATCH(LanguageSelect,LanguageData!$C$2:$L$2,0))","v":"Enhed"}]
[null,{"$f":"INDEX(LanguageData!$C$3:$L$200,MATCH(\"Language\",LanguageData!$B$3:$B$200,0),MATCH(LanguageSelect,LanguageData!$C$2:$L$2,0))","v":"Sprog:"},"Dansk",{"$f":"INDEX(LanguageData!$C$3:$L$200,MATCH(\"CustomerExisting\",LanguageData!$B$3:$B$200,0),MATCH(LanguageSelect,LanguageData!$C$2:$L$2,0))","v":"Købt SW"},null,false,null,{"$f":"HLOOKUP(LanguageSelect,'CurrencyData '!C2:K5,2,FALSE)","v":"DKK"},{"$f":"HLOOKUP(LanguageSelect,'CurrencyData '!C2:K5,3,FALSE)","v":"Danske kroner"},null,null,null,{"$f":"INDEX(LanguageData!$C$3:$L$200,MATCH(\"HigherKitsAvarageResult\",LanguageData!$B$3:$B$200,0),MATCH(LanguageSelect,LanguageData!$C$2:$L$2,0))&\" \" &HigherKitsAvarageResult& \" \" &INDEX(LanguageData!$C$3:$L$200,MATCH(\"Pcs\",LanguageData!$B$3:$B$200,0),MATCH(LanguageSelect,LanguageData!$C$2:$L$2,0)) & \" \" &INDEX(LanguageData!$C$3:$L$200,MATCH(\"And\",LanguageData!$B$3:$B$200,0),MATCH(LanguageSelect,LanguageData!$C$2:$L$2,0))& \" \" &INDEX(LanguageData!$C$3:$L$200,MATCH(\"NewKitsAverage\",LanguageData!$B$3:$B$200,0),MATCH(LanguageSelect,LanguageData!$C$2:$L$2,0))& \" \"  &FIXED(NewKitsAverage,2)& \" \" & INDEX(LanguageData!$C$3:$L$200,MATCH(\"Kit\",LanguageData!$B$3:$B$200,0),MATCH(LanguageSelect,LanguageData!$C$2:$L$2,0))& \" \" & INDEX(LanguageData!$C$3:$L$200,MATCH(\"InAverage\",LanguageData!$B$3:$B$200,0),MATCH(LanguageSelect,LanguageData!$C$2:$L$2,0))","v":"Årlig resultat af øget hvalpegennemsnit er 0 stk. og nyt beregnet hvalpegennemsnit er 0,00 hvalp i gennemsnit"}]
[null,{"$f":"INDEX(LanguageData!$C$3:$L$200,MATCH(\"BaseData\",LanguageData!$B$3:$B$200,0),MATCH(LanguageSelect,LanguageData!$C$2:$L$2,0))","v":"Stam data"},null,null,null,null,null,null,null,null,null,null,{"$f":"INDEX(LanguageData!$C$3:$L$200,MATCH(\"EstimatedProducedSkins\",LanguageData!$B$3:$B$200,0),MATCH(LanguageSelect,LanguageData!$C$2:$L$2,0))","v":"Årligt total forventet produceret skind  inkl. optimering af hvalpegennemsnit"},{"$f":"BreedingFemales*KitsAverage+HigherKitsAvarageResult","v":0},{"$f":"INDEX(LanguageData!$C$3:$L$200,MATCH(\"Pcs\",LanguageData!$B$3:$B$200,0),MATCH(LanguageSelect,LanguageData!$C$2:$L$2,0))","v":"stk."}]
[null,{"$f":"INDEX(LanguageData!$C$3:$L$200,MATCH(\"Description\",LanguageData!$B$3:$B$200,0),MATCH(LanguageSelect,LanguageData!$C$2:$L$2,0))","v":"Beskrivelse"},null,null,{"$f":"INDEX(LanguageData!$C$3:$L$200,MATCH(\"Data\",LanguageData!$B$3:$B$200,0),MATCH(LanguageSelect,LanguageData!$C$2:$L$2,0))","v":"Opgivet data"},null,{"$f":"INDEX(LanguageData!$C$3:$L$200,MATCH(\"Unit\",LanguageData!$B$3:$B$200,0),MATCH(LanguageSelect,LanguageData!$C$2:$L$2,0))","v":"Enhed"},{"$f":"INDEX(LanguageData!$C$3:$L$200,MATCH(\"Consequence\",LanguageData!$B$3:$B$200,0),MATCH(LanguageSelect,LanguageData!$C$2:$L$2,0))","v":"Konsekvens"},{"$f":"INDEX(LanguageData!$C$3:$L$100,MATCH(\"Unit\",LanguageData!$B$3:$B$100,0),MATCH(LanguageSelect,LanguageData!$C$2:$L$2,0))","v":"Enhed"},{"$f":"INDEX(LanguageData!$C$3:$L$100,MATCH(\"Unit\",LanguageData!$B$3:$B$100,0),MATCH(LanguageSelect,LanguageData!$C$2:$L$2,0))","v":"Enhed"},null,null,{"$f":"INDEX(LanguageData!$C$3:$L$200,MATCH(\"CostAnalysis\",LanguageData!$B$3:$B$200,0),MATCH(LanguageSelect,LanguageData!$C$2:$L$2,0))&\" - \"&INDEX(LanguageData!$C$3:$L$200,MATCH(\"BenefitsToGain\",LanguageData!$B$3:$B$200,0),MATCH(LanguageSelect,LanguageData!$C$2:$L$2,0))","v":"Omkostnings - og gevinst analyse - beregnet gevinst"},null,{"$f":"INDEX(LanguageData!$C$3:$L$200,MATCH(\"Unit\",LanguageData!$B$3:$B$200,0),MATCH(LanguageSelect,LanguageData!$C$2:$L$2,0))","v":"Enhed"}]
[null,{"$f":"INDEX(LanguageData!$C$3:$L$200,MATCH(\"NoOfCages\",LanguageData!$B$3:$B$200,0),MATCH(LanguageSelect,LanguageData!$C$2:$L$2,0))","v":"Antal bure"},null,null,null,null,{"$f":"INDEX(LanguageData!$C$3:$L$200,MATCH(\"Pcs\",LanguageData!$B$3:$B$200,0),MATCH(LanguageSelect,LanguageData!$C$2:$L$2,0))","v":"stk."},null,null,null,null,null,{"$f":"INDEX(LanguageData!$C$3:$L$200,MATCH(\"ManHoursSaved\",LanguageData!$B$3:$B$200,0),MATCH(LanguageSelect,LanguageData!$C$2:$L$2,0))","v":"Beregnet arbejdstidsbesparelse pr. år"},{"$f":"(CageCount*CageTimeSave)/60","v":0},{"$f":"INDEX(LanguageData!$C$3:$L$200,MATCH(\"TimeUnitHour\",LanguageData!$B$3:$B$200,0),MATCH(LanguageSelect,LanguageData!$C$2:$L$2,0))","v":"time"}]
[null,{"$f":"INDEX(LanguageData!$C$3:$L$200,MATCH(\"KitsAverage\",LanguageData!$B$3:$B$200,0),MATCH(LanguageSelect,LanguageData!$C$2:$L$2,0))","v":"Hvalpe gennemsnit"},null,null,null,null,{"$f":"INDEX(LanguageData!$C$3:$L$200,MATCH(\"Kit\",LanguageData!$B$3:$B$200,0),MATCH(LanguageSelect,LanguageData!$C$2:$L$2,0))","v":"hvalp"},null,{"$f":"NewKitsAverage","v":0},{"$f":"IF($I$9>0,INDEX(LanguageData!$C$3:$L$200,MATCH(\"Kit\",LanguageData!$B$3:$B$200,0),MATCH(LanguageSelect,LanguageData!$C$2:$L$2,0)),0)","v":0},null,null,{"$f":"INDEX(LanguageData!$C$3:$L$200,MATCH(\"ValueWorktime\",LanguageData!$B$3:$B$200,0),MATCH(LanguageSelect,LanguageData!$C$2:$L$2,0))","v":"Beregnet værdi af arbejdstidsbesparelse pr. år"},{"$f":"CageCount*CageTimeSave*(WageCosts/60)","v":0},{"$f":"INDEX(LanguageData!$C$3:$L$200,MATCH(\"CostsUnit\",LanguageData!$B$3:$B$200,0),MATCH(LanguageSelect,LanguageData!$C$2:$L$2,0))","v":"kr."}]
[null,{"$f":"INDEX(LanguageData!$C$3:$L$200,MATCH(\"BreedingFemales\",LanguageData!$B$3:$B$200,0),MATCH(LanguageSelect,LanguageData!$C$2:$L$2,0))","v":"Avls tæver"},null,null,null,null,{"$f":"INDEX(LanguageData!$C$3:$L$200,MATCH(\"Females\",LanguageData!$B$3:$B$200,0),MATCH(LanguageSelect,LanguageData!$C$2:$L$2,0))","v":"tæver"},null,null,null,null,null,{"$f":"INDEX(LanguageData!$C$3:$L$200,MATCH(\"ValueSkinsSize\",LanguageData!$B$3:$B$200,0),MATCH(LanguageSelect,LanguageData!$C$2:$L$2,0))","v":"Beregnet værdi af skind størrelses forøgelse pr. år"},{"$f":"EstimatedProducedSkins*SizeIncreasePercent*SizeProfit","v":0},{"$f":"INDEX(LanguageData!$C$3:$L$200,MATCH(\"CostsUnit\",LanguageData!$B$3:$B$200,0),MATCH(LanguageSelect,LanguageData!$C$2:$L$2,0))","v":"kr."}]
[null,{"$f":"INDEX(LanguageData!$C$3:$L$200,MATCH(\"HourlyWage\",LanguageData!$B$3:$B$200,0),MATCH(LanguageSelect,LanguageData!$C$2:$L$2,0))","v":"Timeløn inkl. sociale omkostninger"},null,null,null,null,{"$f":"INDEX(LanguageData!$C$3:$L$200,MATCH(\"CostsUnit\",LanguageData!$B$3:$B$200,0),MATCH(LanguageSelect,LanguageData!$C$2:$L$2,0))","v":"kr."},null,null,null,null,null,{"$f":"INDEX(LanguageData!$C$3:$L$200,MATCH(\"ValueLitterSize\",LanguageData!$B$3:$B$200,0),MATCH(LanguageSelect,LanguageData!$C$2:$L$2,0))","v":"Beregnet værdi af kuld størrelses forøgelse pr. år"},{"$f":"KitsAverageImprovement*BreedingFemales*SkinsProfit","v":0},{"$f":"INDEX(LanguageData!$C$3:$L$200,MATCH(\"CostsUnit\",LanguageData!$B$3:$B$200,0),MATCH(LanguageSelect,LanguageData!$C$2:$L$2,0))","v":"kr."}]
[null,{"$f":"INDEX(LanguageData!$C$3:$L$200,MATCH(\"TimeSave\",LanguageData!$B$3:$B$200,0),MATCH(LanguageSelect,LanguageData!$C$2:$L$2,0))","v":"Forventet tidsbesparelse pr. bur i minutter"},null,null,null,null,{"$f":"INDEX(LanguageData!$C$3:$L$200,MATCH(\"TimeUnitMinute\",LanguageData!$B$3:$B$200,0),MATCH(LanguageSelect,LanguageData!$C$2:$L$2,0))","v":"minut"},null,{"$f":"IF((CageCount*CageTimeSave)/60>1,(CageCount*CageTimeSave)/60,0)","v":0},{"$f":"IF($I$12>1,INDEX(LanguageData!$C$3:$L$200,MATCH(\"TimeUnitHour\",LanguageData!$B$3:$B$200,0),MATCH(LanguageSelect,LanguageData!$C$2:$L$2,0)),0)","v":0},null,null,{"$f":"INDEX(LanguageData!$C$3:$L$200,MATCH(\"ValueOfFeedSaving\",LanguageData!$B$3:$B$200,0),MATCH(LanguageSelect,LanguageData!$C$2:$L$2,0))","v":"Beregnet værdi af foderændring pr. år"},{"$f":"EstimatedProducedSkins*FeedCostPrice*FeedSavingInKg","v":0},{"$f":"INDEX(LanguageData!$C$3:$L$200,MATCH(\"CostsUnit\",LanguageData!$B$3:$B$200,0),MATCH(LanguageSelect,LanguageData!$C$2:$L$2,0))","v":"kr."}]
[null,{"$f":"INDEX(LanguageData!$C$3:$L$200,MATCH(\"SkinsSizeIncrease\",LanguageData!$B$3:$B$200,0),MATCH(LanguageSelect,LanguageData!$C$2:$L$2,0))","v":"Forventet pristillæg for en størrelse større skind"},null,null,null,null,{"$f":"INDEX(LanguageData!$C$3:$L$200,MATCH(\"CostsUnit\",LanguageData!$B$3:$B$200,0),MATCH(LanguageSelect,LanguageData!$C$2:$L$2,0))","v":"kr."}]
[null,{"$f":"INDEX(LanguageData!$C$3:$L$200,MATCH(\"NoSkinsSizeIncreaseProcent\",LanguageData!$B$3:$B$200,0),MATCH(LanguageSelect,LanguageData!$C$2:$L$2,0))","v":"Del af skind som øges en størrelse i procent (Maks. 100%)"},null,null,null,null,{"$f":"INDEX(LanguageData!$C$3:$L$200,MATCH(\"Percent\",LanguageData!$B$3:$B$200,0),MATCH(LanguageSelect,LanguageData!$C$2:$L$2,0))","v":"procent"},null,{"$f":"IF(SizeIncreasePercent*BreedingFemales*KitsAverage>1,SizeIncreasePercent*BreedingFemales*KitsAverage,0)","v":0},{"$f":"IF($I$14>1,INDEX(LanguageData!$C$3:$L$200,MATCH(\"Skins\",LanguageData!$B$3:$B$200,0),MATCH(LanguageSelect,LanguageData!$C$2:$L$2,0)),0)","v":0},null,null,{"$f":"INDEX(LanguageData!$C$3:$L$200,MATCH(\"TotalGains\",LanguageData!$B$3:$B$200,0),MATCH(LanguageSelect,LanguageData!$C$2:$L$2,0))","v":"Samlet beregnet sum af gevinst pr. år"},{"$f":"SUM(N8:N13)","v":0},{"$f":"INDEX(LanguageData!$C$3:$L$200,MATCH(\"CostsUnit\",LanguageData!$B$3:$B$200,0),MATCH(LanguageSelect,LanguageData!$C$2:$L$2,0))","v":"kr."}]
[null,{"$f":"INDEX(LanguageData!$C$3:$L$200,MATCH(\"DepreciationYears\",LanguageData!$B$3:$B$200,0),MATCH(LanguageSelect,LanguageData!$C$2:$L$2,0))","v":"Antal år for værdimæssigt afskrivning af hardware"},null,null,null,null,{"$f":"INDEX(LanguageData!$C$3:$L$200,MATCH(IF(DepreciationYears<=1,\"TimeUnitYear\",\"TimeUnitYears\"),LanguageData!$B$3:$B$200,0),MATCH(LanguageSelect,LanguageData!$C$2:$L$2,0))","v":"år"},null,null,null,null,null,{"$f":"INDEX(LanguageData!$C$3:$L$200,MATCH(\"CostAnalysis\",LanguageData!$B$3:$B$200,0),MATCH(LanguageSelect,LanguageData!$C$2:$L$2,0))&\" - \"&INDEX(LanguageData!$C$3:$L$200,MATCH(\"InDepreciationPeriode\",LanguageData!$B$3:$B$200,0),MATCH(LanguageSelect,LanguageData!$C$2:$L$2,0))&\" \" & IF(DepreciationYears=\"\",\"X \",DepreciationYears & \" \")  &$G$15","v":"Omkostnings - og gevinst analyse - årlig pr. skind i afskrivningsperioden i X år"},null,{"$f":"INDEX(LanguageData!$C$3:$L$200,MATCH(\"Unit\",LanguageData!$B$3:$B$200,0),MATCH(LanguageSelect,LanguageData!$C$2:$L$2,0))","v":"Enhed"}]
{"$rows_left_out":81}
{"sheet":"ItemsData","index":1,"n_rows":28,"n_cols":6,"rows_kept":28,"cut":false,"hidden":true,"merged":[]}
[]
[null,null,"Item Number","Item Name in NAV","Price in DKK","Language Label"]
[null,null,101000,"PDA PA692",15000,"ItNo101000"]
[null,null,120055,"Data Tablet Unitech PA700 2D",8500,"ItNo120055"]
[null,null,103000,"Foder tablet ToughShield T700",10500,"ItNo103000"]
[null,null,"120003","Twinca Easy, 6-polet U/ beslag ",15500,"ItNo120003"]
[null,null,"120100","Burnummer Etiket Kraftig",1.75,"ItNo120100"]
[null,null,"120012","Burnummer Etiket Klistemærke",3.5,"ItNo120012"]
[null,null,105001,"Opdatering fra TS3 til TS",15000,"ItNo105001"]
[]
[]
[]
[]
[]
[]
{"$rows_left_out":14}
{"sheet":"LanguageData","index":2,"n_rows":108,"n_cols":15,"rows_kept":108,"cut":false,"hidden":true,"merged":[]}
[]
[null,"Language Label","Dansk","English",null,null,null,null,null,null,null,null,null,"LabelName","Computed value"]
[null,"Language","Sprog:","Language:",null,null,null,null,null,null,null,null,null,"DiagramTitel_1",{"$f":"INDEX(LanguageData!$C$3:$L$200,MATCH(\"RatioCostBenefit\",LanguageData!$B$3:$B$200,0),MATCH(LanguageSelect,LanguageData!$C$2:$L$2,0)) & \" \" & INDEX(LanguageData!$C$3:$L$200,MATCH(\"For\",LanguageData!$B$3:$B$200,0),MATCH(LanguageSelect,LanguageData!$C$2:$L$2,0)) & \" \" & NoOfYearsForGraph & \" \" &INDEX(LanguageData!$C$3:$L$200,MATCH(IF(NoOfYearsForGraph<=1,\"TimeUnitYear\",\"TimeUnitYears\"),LanguageData!$B$3:$B$200,0),MATCH(LanguageSelect,LanguageData!$C$2:$L$2,0))","v":"Årets overskud over 5 år"}]
[null,"SelectLanguageBelow","Vælg sprog herunder, klik for at vælge.","Select language below, click to Select.",null,null,null,null,null,null,null,null,null,"AxisTitel_1",{"$f":"INDEX(LanguageData!$C$3:$L$200,MATCH(\"CapYear\",LanguageData!$B$3:$B$200,0),MATCH(LanguageSelect,LanguageData!$C$2:$L$2,0))","v":"År"}]
[null,"Currency","Valuta","Currency",null,null,null,null,null,null,null,null,null,"AxisTitel_2",{"$f":"HLOOKUP(LanguageSelect,'CurrencyData '!C2:K5,3,FALSE)","v":"Danske kroner"}]
[null,"BaseData","Stam data","Base data",null,null,null,null,null,null,null,null,null,"DiagramTitel_2",{"$f":"INDEX(LanguageData!$C$3:$L$200,MATCH(\"TotalFinancialGainOverTime\",LanguageData!$B$3:$B$200,0),MATCH(LanguageSelect,LanguageData!$C$2:$L$2,0)) & \" \" & INDEX(LanguageData!$C$3:$L$200,MATCH(\"For\",LanguageData!$B$3:$B$200,0),MATCH(LanguageSelect,LanguageData!$C$2:$L$2,0)) & \" \" & NoOfYearsForGraph & \" \" &INDEX(LanguageData!$C$3:$L$200,MATCH(IF(NoOfYearsForGraph<=1,\"TimeUnitYear\",\"TimeUnitYears\"),LanguageData!$B$3:$B$200,0),MATCH(LanguageSelect,LanguageData!$C$2:$L$2,0))","v":"Total akkumuleret økonomisk overskud over 5 år"}]
[null,"NoOfCages","Antal bure","Cage count",null,null,null,null,null,null,null,null,null,"DiagramTitel_3",{"$f":"INDEX(LanguageData!$C$3:$L$200,MATCH(\"GainPerSkinsInDepreciationPeriode\",LanguageData!$B$3:$B$200,0),MATCH(LanguageSelect,LanguageData!$C$2:$L$2,0)) & \" \" & INDEX(LanguageData!$C$3:$L$200,MATCH(\"At\",LanguageData!$B$3:$B$200,0),MATCH(LanguageSelect,LanguageData!$C$2:$L$2,0)) & \" \" & IF(DepreciationYears=\"\",\"X\",DepreciationYears) & \" \" &INDEX(LanguageData!$C$3:$L$200,MATCH(IF(DepreciationYears<=1,\"TimeUnitYear\",\"TimeUnitYears\"),LanguageData!$B$3:$B$200,0),MATCH(LanguageSelect,LanguageData!$C$2:$L$2,0))","v":"Samlet beregnet overskud pr. produceret skind pr. år i afskrivningsperiode på X år"}]
[null,"BreedingFemales","Avls tæver","Breeding females",null,null,null,null,null,null,null,null,null,"DiagramTitel_4",{"$f":"INDEX(LanguageData!$C$3:$L$200,MATCH(\"GainPerSkinsAfterDepreciationPeriode\",LanguageData!$B$3:$B$200,0),MATCH(LanguageSelect,LanguageData!$C$2:$L$2,0)) & \" \" & INDEX(LanguageData!$C$3:$L$200,MATCH(\"At\",LanguageData!$B$3:$B$200,0),MATCH(LanguageSelect,LanguageData!$C$2:$L$2,0)) & \" \" & IF(DepreciationYears = \"\",\"X\",DepreciationYears) & \" \" &INDEX(LanguageData!$C$3:$L$200,MATCH(IF(DepreciationYears<=1,\"TimeUnitYear\",\"TimeUnitYears\"),LanguageData!$B$3:$B$200,0),MATCH(LanguageSelect,LanguageData!$C$2:$L$2,0))","v":"Samlet beregnet overskud pr. produceret skind pr. år efter afskrivningsperiode på X år"}]
[null,"KitsAverage","Hvalpe gennemsnit","Kits average"]
[null,"ItemNo","Varenummer","Item number"]
[null,"ItemDescription","Vare beskrivelse","Item description"]
[null,"NumberOfItems","Antal","Number of items"]
[null,"UnitPrice","Stykpris","Unit price"]
[null,"TotalAmount","Total beløb","Total amount"]
[null,"PartsList","Stykliste","Parts list"]
{"$rows_left_out":94}
{"sheet":"CurrencyData ","index":3,"n_rows":5,"n_cols":4,"rows_kept":5,"cut":false,"hidden":true,"merged":[]}
[]
[null,"Language","Dansk","English"]
[null,"Currency ","DKK","EUR"]
[null,"Currency Name","Danske kroner","Euro"]
[null,"CurrencyFactor",1,7.45]

{"sheet":"ProgramData","index":4,"n_rows":26,"n_cols":10,"rows_kept":26,"cut":false,"hidden":true,"merged":[[5,1,5,2],[5,3,5,9]]}
[]
[null,null,"Program version"]
[null,null,"1.0.3.5"]
[]
[null,{"$f":"INDEX(LanguageData!$C$3:$L$200,MATCH(\"CapYear\",LanguageData!$B$3:$B$200,0),MATCH(LanguageSelect,LanguageData!$C$2:$L$2,0))","v":"År"},{"$f":"INDEX(LanguageData!$C$3:$L$200,MATCH(\"AnnualCosts\",LanguageData!$B$3:$B$200,0),MATCH(LanguageSelect,LanguageData!$C$2:$L$2,0))","v":"Årets omkostninger"},{"$f":"INDEX(LanguageData!$C$3:$L$200,MATCH(\"TotalCostsOverTime\",LanguageData!$B$3:$B$200,0),MATCH(LanguageSelect,LanguageData!$C$2:$L$2,0))","v":"Total akkumuleret omkostninger over tid"},{"$f":"INDEX(LanguageData!$C$3:$L$200,MATCH(\"AnnualGain\",LanguageData!$B$3:$B$200,0),MATCH(LanguageSelect,LanguageData!$C$2:$L$2,0))","v":"Årets økonomiske gevinst"},{"$f":"INDEX(LanguageData!$C$3:$L$200,MATCH(\"TotalGainOverTime\",LanguageData!$B$3:$B$200,0),MATCH(LanguageSelect,LanguageData!$C$2:$L$2,0))","v":"Total akkumuleret gevinst"},{"$f":"INDEX(LanguageData!$C$3:$L$200,MATCH(\"AnnualFinancialGain\",LanguageData!$B$3:$B$200,0),MATCH(LanguageSelect,LanguageData!$C$2:$L$2,0))","v":"Årets økonomisk overskud"},{"$f":"INDEX(LanguageData!$C$3:$L$200,MATCH(\"TotalFinancialGainOverTime\",LanguageData!$B$3:$B$200,0),MATCH(LanguageSelect,LanguageData!$C$2:$L$2,0))","v":"Total akkumuleret økonomisk overskud"},{"$f":"INDEX(LanguageData!$C$3:$L$200,MATCH(\"OverAllRatioCostBenefitOverTime\",LanguageData!$B$3:$B$200,0),MATCH(LanguageSelect,LanguageData!$C$2:$L$2,0))","v":"Akkumuleret forhold mellem omkostninger og overskud over tid fra år et"},{"$f":"INDEX(LanguageData!$C$3:$L$200,MATCH(\"RatioCostBenefit\",LanguageData!$B$3:$B$200,0),MATCH(LanguageSelect,LanguageData!$C$2:$L$2,0))","v":"Årets overskud"}]
[null,{"$f":"INDEX(LanguageData!$C$3:$L$200,MATCH(\"GoToUserData\",LanguageData!$B$3:$B$200,0),MATCH(LanguageSelect,LanguageData!$C$2:$L$2,0))","v":"Tilbage til stamdata. Klik her!"}]
[null,1,{"$f":"IF(B7<=DepreciationYears,AnnualDepreciation+AnaualSupportCost,AnaualSupportCost)","v":0},{"$f":"C7","v":0},{"$f":"TotalGains","v":0},{"$f":"E7","v":0},{"$f":"E7-C7","v":0},{"$f":"G7","v":0},{"$f":"IFERROR(ROUND(H7/D7,2),\"\")","v":""},{"$f":"IFERROR(ROUND(G7/C7,2),\"\")","v":""}]
[null,2,0,{"$f":"D7+C8","v":0},0,{"$f":"F7+E8","v":0},{"$f":"E8-C8","v":0},{"$f":"H7+G8","v":0},{"$f":"IFERROR(ROUND(H8/D8,2),\"\")","v":""},{"$f":"IFERROR(ROUND(E8/C8,2),\"\")","v":""}]
[null,3,0,{"$f":"D8+C9","v":0},0,{"$f":"F8+E9","v":0},{"$f":"E9-C9","v":0},{"$f":"H8+G9","v":0},"",""]
[null,4,0,0,0,0,{"$f":"E10-C10","v":0},{"$f":"H9+G10","v":0},"",""]
[null,5,0,0,0,0,0,0,"",""]
[null,6,0,0,0,0,0,0,"",""]
[null,7,0,0,0,0,0,0,"",""]
[null,8,0,0,0,0,0,0,"",""]
[null,9,0,0,0,0,0,0,"",""]
{"$rows_left_out":11}